We're updating the issue view to help you get more done. 

sessionTest fails under windows

Description

sessionTest fails under windows only Debug vc-140 config:

1 2 3 4 5 6 7 8 9 10 11 12 13 14 15 16 17 18 19 20 21 22 23 24 25 26 27 28 29 30 31 32 33 34 35 36 37 38 39 40 41 42 43 W:\f8\fix8pro\msvc\x64\bin\Debug-vc140>sessionTestd.exe Running main() from gtest_main.cc [==========] Running 6 tests from 2 test cases. [----------] Global test environment set-up. [----------] 1 test from sessionId [ RUN ] sessionId.sessionId [ OK ] sessionId.sessionId (1 ms) [----------] 1 test from sessionId (304 ms total) [----------] 5 tests from sessionTest [ RUN ] sessionTest.logon [ OK ] sessionTest.logon (3 ms) [ RUN ] sessionTest.handle_resend_request [ OK ] sessionTest.handle_resend_request (66 ms) [ RUN ] sessionTest.handle_seq_reset [ OK ] sessionTest.handle_seq_reset (2 ms) [ RUN ] sessionTest.handle_test_request [ OK ] sessionTest.handle_test_request (3 ms) [ RUN ] sessionTest.send_test_request w:\f8\fix8pro\utests\session_test.cpp(506): error: Value of: output.find("35=1") != std::string::npos Actual: false Expected: true w:\f8\fix8pro\utests\session_test.cpp(507): error: Value of: initiator_test->ss->getState() Actual: 1 Expected: States::st_test_request_sent Which is: 9 w:\f8\fix8pro\utests\session_test.cpp(530): error: Value of: initiator_test->ss->getState() Actual: 1 Expected: States::st_logoff_sent Which is: 7 w:\f8\fix8pro\utests\session_test.cpp(531): error: Value of: output.find("35=5") != std::string::npos Actual: false Expected: true [ FAILED ] sessionTest.send_test_request (209 ms) [----------] 5 tests from sessionTest (1518 ms total) [----------] Global test environment tear-down [==========] 6 tests from 2 test cases ran. (2603 ms total) [ PASSED ] 5 tests. [ FAILED ] 1 test, listed below: [ FAILED ] sessionTest.send_test_request 1 FAILED TEST

Environment

None

Status

Assignee

Sergey Sedreev

Reporter

Sergey Sedreev

Labels

Branch

dev

Products

All

Components

Fix versions

Affects versions

2.2.1
1.3.4

Priority

Critical